Reaction Details
TargetCytochrome P450 1A2
LigandBDBM50081716
Substrate/Competitorn/a
Meas. Tech.ChEMBL_1474528 (CHEMBL3423817)
IC50 61±n/a nM
Citation Cui, JMeng, QZhang, XCui, QZhou, WLi, S Design and Synthesis of Newa-Naphthoflavones as Cytochrome P450 (CYP) 1B1 Inhibitors To Overcome Docetaxel-Resistance Associated with CYP1B1 Overexpression. J Med Chem58:3534-47 (2015) 
 
Cytochrome P450 1A2
Name:Cytochrome P450 1A2
Type:Enzyme
Mol. Mass.:58423.38
Organism:Homo sapiens (Human)
Description:P05177
Residue:516
BDBM50081716
NameBDBM50081716
Synonyms:CHEMBL3422337
TypeSmall organic molecule
Emp. Form.C22H17ClO5
Mol. Mass.396.82
SMILESCOc1ccc(OC)c2c3oc(cc(=O)c3cc(OC)c12)-c1cccc(Cl)c1