Reaction Details
TargetCytochrome P450 1A1
LigandBDBM50081721
Substrate/Competitorn/a
Meas. Tech.ChEMBL_1474527 (CHEMBL3423816)
IC50 12±n/a nM
Citation Cui, JMeng, QZhang, XCui, QZhou, WLi, S Design and Synthesis of Newa-Naphthoflavones as Cytochrome P450 (CYP) 1B1 Inhibitors To Overcome Docetaxel-Resistance Associated with CYP1B1 Overexpression. J Med Chem58:3534-47 (2015) 
 
Cytochrome P450 1A1
Name:Cytochrome P450 1A1
Type:Protein
Mol. Mass.:58177.23
Organism:Homo sapiens (Human)
Description:P04798
Residue:512
BDBM50081721
NameBDBM50081721
Synonyms:CHEMBL3422341
TypeSmall organic molecule
Emp. Form.C24H22O7
Mol. Mass.422.4273
SMILESCOc1ccc(cc1OC)-c1cc(=O)c2cc(OC)c3c(OC)ccc(OC)c3c2o1