Reaction Details
TargetCytochrome P450 1B1
LigandBDBM50081873
Substrate/Competitorn/a
Meas. Tech.ChEMBL_1474526 (CHEMBL3423815)
IC50 1.2±n/a nM
Citation Cui, JMeng, QZhang, XCui, QZhou, WLi, S Design and Synthesis of Newa-Naphthoflavones as Cytochrome P450 (CYP) 1B1 Inhibitors To Overcome Docetaxel-Resistance Associated with CYP1B1 Overexpression. J Med Chem58:3534-47 (2015) 
 
Cytochrome P450 1B1
Name:Cytochrome P450 1B1
Type:PROTEIN
Mol. Mass.:60861.81
Organism:Homo sapiens (Human)
Description:ChEMBL_1474523
Residue:543
BDBM50081873
NameBDBM50081873
Synonyms:CHEMBL3422348
TypeSmall organic molecule
Emp. Form.C22H17FO6
Mol. Mass.396.3652
SMILESCOc1ccc(OC)c2c1c(OC)cc1c2oc(c(O)c1=O)-c1ccccc1F