Reaction Details
TargetCytochrome P450 1A1
LigandBDBM50081878
Substrate/Competitorn/a
Meas. Tech.ChEMBL_1474527 (CHEMBL3423816)
IC50 27±n/a nM
Citation Cui, JMeng, QZhang, XCui, QZhou, WLi, S Design and Synthesis of Newa-Naphthoflavones as Cytochrome P450 (CYP) 1B1 Inhibitors To Overcome Docetaxel-Resistance Associated with CYP1B1 Overexpression. J Med Chem58:3534-47 (2015) 
 
Cytochrome P450 1A1
Name:Cytochrome P450 1A1
Type:Protein
Mol. Mass.:58177.23
Organism:Homo sapiens (Human)
Description:P04798
Residue:512
BDBM50081878
NameBDBM50081878
Synonyms:CHEMBL3422353
TypeSmall organic molecule
Emp. Form.C22H17ClO6
Mol. Mass.412.82
SMILESCOc1ccc(OC)c2c1c(OC)cc1c2oc(-c2ccc(Cl)cc2)c(O)c1=O