Reaction Details
TargetKiSS-1 receptor
LigandBDBM50082067
Substrate/Competitorn/a
Meas. Tech.ChEMBL_1474616 (CHEMBL3423932)
EC50 0.100000±n/a nM
Citation Beltramo, MRobert, VGalibert, MMadinier, JBMarceau, PDardente, HDecourt, CDe Roux, NLomet, DDelmas, AFCaraty, AAucagne, V Rational design of triazololipopeptides analogs of kisspeptin inducing a long-lasting increase of gonadotropins. J Med Chem58:3459-70 (2015) 
 
KiSS-1 receptor
Name:KiSS-1 receptor
Type:G Protein-Coupled Receptor (GPCR)
Mol. Mass.:42613.79
Organism:Homo sapiens (Human)
Description:Binding assay was performed using membranes from the CHO cell transfectants.
Residue:398
BDBM50082067
NameBDBM50082067
Synonyms:CHEMBL3422413
TypeSmall organic molecule
Emp. Form.C69H93N17O16
Mol. Mass.1416.581
SMILESCC(C)C[C@H](NC(=O)CNC(=O)[C@H](Cc1ccccc1)NC(=O)[C@H](CO)NC(=O)[C@H](CC(N)=O)NC(=O)[C@H](Cc1c[nH]c2ccccc12)NC(=O)[C@H](CCCCNC(C)=O)NC(=O)[C@H](Cc1ccc(O)cc1)NC(C)=O)C(=O)N[C@@H](CCCNC(N)=N)C(=O)N[C@@H](Cc1ccc(O)cc1)C(N)=O