Reaction Details
Target6-phosphofructo-2-kinase/fructose-2,6-bisphosphatase 2
LigandBDBM50082119
Substrate/Competitorn/a
Meas. Tech.ChEMBL_1475279 (CHEMBL3425139)
IC50 11800±n/a nM
Citation Boyd, SBrookfield, JLCritchlow, SECumming, IACurtis, NJDebreczeni, JDegorce, SLDonald, CEvans, NJGroombridge, SHopcroft, PJones, NPKettle, JGLamont, SLewis, HJMacFaull, PMcLoughlin, SBRigoreau, LJSmith, JMSt-Gallay, SStock, JKTurnbull, APWheatley, ERWinter, JWingfield, J Structure-Based Design of Potent and Selective Inhibitors of the Metabolic Kinase PFKFB3. J Med Chem58:3611-25 (2015) 
 
6-phosphofructo-2-kinase/fructose-2,6-bisphosphatase 2
Name:6-phosphofructo-2-kinase/fructose-2,6-bisphosphatase 2
Type:PROTEIN
Mol. Mass.:58485.20
Organism:Homo sapiens (Human)
Description:ChEMBL_109607
Residue:505
BDBM50082119
NameBDBM50082119
Synonyms:CHEMBL3422679
TypeSmall organic molecule
Emp. Form.C19H18N6O2
Mol. Mass.362.3852
SMILESCn1cc(cn1)-c1n[nH]c2ccc(Oc3ccc(NC(=O)CN)cc3)cc12