Reaction Details
Target6-phosphofructo-2-kinase/fructose-2,6-bisphosphatase 3
LigandBDBM50082205
Substrate/Competitorn/a
Meas. Tech.ChEMBL_1475280 (CHEMBL3425140)
IC50 256±n/a nM
Citation Boyd, SBrookfield, JLCritchlow, SECumming, IACurtis, NJDebreczeni, JDegorce, SLDonald, CEvans, NJGroombridge, SHopcroft, PJones, NPKettle, JGLamont, SLewis, HJMacFaull, PMcLoughlin, SBRigoreau, LJSmith, JMSt-Gallay, SStock, JKTurnbull, APWheatley, ERWinter, JWingfield, J Structure-Based Design of Potent and Selective Inhibitors of the Metabolic Kinase PFKFB3. J Med Chem58:3611-25 (2015) 
 
6-phosphofructo-2-kinase/fructose-2,6-bisphosphatase 3
Name:6-phosphofructo-2-kinase/fructose-2,6-bisphosphatase 3
Type:Enzyme
Mol. Mass.:59620.59
Organism:Homo sapiens (Human)
Description:Q16875
Residue:520
BDBM50082205
NameBDBM50082205
Synonyms:CHEMBL3422671
TypeSmall organic molecule
Emp. Form.C24H27N5O2
Mol. Mass.417.5035
SMILESCN(C)CCn1cc(C#N)c2cc(Oc3ccc(NC(=O)[C@@H]4CCCN4)cc3)ccc12