Reaction Details
Target6-phosphofructo-2-kinase/fructose-2,6-bisphosphatase 1
LigandBDBM50082129
Substrate/Competitorn/a
Meas. Tech.ChEMBL_1475278 (CHEMBL3425138)
IC50 61500±n/a nM
Citation Boyd, SBrookfield, JLCritchlow, SECumming, IACurtis, NJDebreczeni, JDegorce, SLDonald, CEvans, NJGroombridge, SHopcroft, PJones, NPKettle, JGLamont, SLewis, HJMacFaull, PMcLoughlin, SBRigoreau, LJSmith, JMSt-Gallay, SStock, JKTurnbull, APWheatley, ERWinter, JWingfield, J Structure-Based Design of Potent and Selective Inhibitors of the Metabolic Kinase PFKFB3. J Med Chem58:3611-25 (2015) 
 
6-phosphofructo-2-kinase/fructose-2,6-bisphosphatase 1
Name:6-phosphofructo-2-kinase/fructose-2,6-bisphosphatase 1
Type:PROTEIN
Mol. Mass.:54681.17
Organism:Homo sapiens (Human)
Description:ChEMBL_109606
Residue:471
BDBM50082129
NameBDBM50082129
Synonyms:CHEMBL3421643
TypeSmall organic molecule
Emp. Form.C18H17N5O3
Mol. Mass.351.3593
SMILESN[C@H](CO)C(=O)Nc1ccc(Oc2ccc3[nH]c(N)c(C#N)c3c2)cc1