Reaction Details
Target6-phosphofructo-2-kinase/fructose-2,6-bisphosphatase 1
LigandBDBM50082115
Substrate/Competitorn/a
Meas. Tech.ChEMBL_1475278 (CHEMBL3425138)
IC50 1830±n/a nM
Citation Boyd, SBrookfield, JLCritchlow, SECumming, IACurtis, NJDebreczeni, JDegorce, SLDonald, CEvans, NJGroombridge, SHopcroft, PJones, NPKettle, JGLamont, SLewis, HJMacFaull, PMcLoughlin, SBRigoreau, LJSmith, JMSt-Gallay, SStock, JKTurnbull, APWheatley, ERWinter, JWingfield, J Structure-Based Design of Potent and Selective Inhibitors of the Metabolic Kinase PFKFB3. J Med Chem58:3611-25 (2015) 
 
6-phosphofructo-2-kinase/fructose-2,6-bisphosphatase 1
Name:6-phosphofructo-2-kinase/fructose-2,6-bisphosphatase 1
Type:PROTEIN
Mol. Mass.:54681.17
Organism:Homo sapiens (Human)
Description:ChEMBL_109606
Residue:471
BDBM50082115
NameBDBM50082115
Synonyms:CHEMBL3422675
TypeSmall organic molecule
Emp. Form.C27H24N4O2
Mol. Mass.436.5051
SMILESO=C(Nc1ccc(Oc2ccc3n(Cc4ccccc4)cc(C#N)c3c2)cc1)[C@@H]1CCCN1