Reaction Details
Target6-phosphofructo-2-kinase/fructose-2,6-bisphosphatase 2
LigandBDBM50082204
Substrate/Competitorn/a
Meas. Tech.ChEMBL_1475279 (CHEMBL3425139)
IC50 2350±n/a nM
Citation Boyd, SBrookfield, JLCritchlow, SECumming, IACurtis, NJDebreczeni, JDegorce, SLDonald, CEvans, NJGroombridge, SHopcroft, PJones, NPKettle, JGLamont, SLewis, HJMacFaull, PMcLoughlin, SBRigoreau, LJSmith, JMSt-Gallay, SStock, JKTurnbull, APWheatley, ERWinter, JWingfield, J Structure-Based Design of Potent and Selective Inhibitors of the Metabolic Kinase PFKFB3. J Med Chem58:3611-25 (2015) 
 
6-phosphofructo-2-kinase/fructose-2,6-bisphosphatase 2
Name:6-phosphofructo-2-kinase/fructose-2,6-bisphosphatase 2
Type:PROTEIN
Mol. Mass.:58485.20
Organism:Homo sapiens (Human)
Description:ChEMBL_109607
Residue:505
BDBM50082204
NameBDBM50082204
Synonyms:CHEMBL3422670
TypeSmall organic molecule
Emp. Form.C23H23N5O3
Mol. Mass.417.4604
SMILESCNC(=O)Cn1cc(C#N)c2cc(Oc3ccc(NC(=O)[C@@H]4CCCN4)cc3)ccc12