Reaction Details
TargetCytochrome P450 11B1, mitochondrial
LigandBDBM50082294
Substrate/Competitorn/a
Meas. Tech.ChEMBL_1475486 (CHEMBL3424479)
IC50 6.0±n/a nM
Citation Hu, QKunde, JHanke, NHartmann, RW Identification of 4-(4-nitro-2-phenethoxyphenyl)pyridine as a promising new lead for discovering inhibitors of both human and rat 11ß-Hydroxylase. Eur J Med Chem96:139-50 (2015) 
 
Cytochrome P450 11B1, mitochondrial
Name:Cytochrome P450 11B1, mitochondrial
Type:Enzyme
Mol. Mass.:57591.44
Organism:Homo sapiens (Human)
Description:P15538
Residue:503
BDBM50082294
NameBDBM50082294
Synonyms:CHEMBL3421786
TypeSmall organic molecule
Emp. Form.C20H18N2O3
Mol. Mass.334.3685
SMILES[O-][N+](=O)c1ccc(Cc2ccncc2)c(OCCc2ccccc2)c1