Reaction Details
TargetCarbonic anhydrase 1
LigandBDBM50082738
Substrate/Competitorn/a
Meas. Tech.ChEMBL_1475737 (CHEMBL3424939)
Ki 421±n/a nM
Citation Durgun, MTurkmen, HCeruso, MSupuran, CT Synthesis of Schiff base derivatives of 4-(2-aminoethyl)-benzenesulfonamide with inhibitory activity against carbonic anhydrase isoforms I, II, IX and XII. Bioorg Med Chem Lett25:2377-81 (2015) 
 
Carbonic anhydrase 1
Name:Carbonic anhydrase 1
Type:Enzyme
Mol. Mass.:28873.37
Organism:Homo sapiens (Human)
Description:P00915
Residue:261
BDBM50082738
NameBDBM50082738
Synonyms:CHEMBL3423249
TypeSmall organic molecule
Emp. Form.C15H14Br2N2O3S
Mol. Mass.462.156
SMILESNS(=O)(=O)c1ccc(CC\N=C/c2cc(Br)cc(Br)c2O)cc1