Reaction Details
TargetCarbonic anhydrase 1
LigandBDBM50082757
Substrate/Competitorn/a
Meas. Tech.ChEMBL_1475737 (CHEMBL3424939)
Ki 453±n/a nM
Citation Durgun, MTurkmen, HCeruso, MSupuran, CT Synthesis of Schiff base derivatives of 4-(2-aminoethyl)-benzenesulfonamide with inhibitory activity against carbonic anhydrase isoforms I, II, IX and XII. Bioorg Med Chem Lett25:2377-81 (2015) 
 
Carbonic anhydrase 1
Name:Carbonic anhydrase 1
Type:Enzyme
Mol. Mass.:28873.37
Organism:Homo sapiens (Human)
Description:P00915
Residue:261
BDBM50082757
NameBDBM50082757
Synonyms:CHEMBL3423258
TypeSmall organic molecule
Emp. Form.C17H21N3O2S
Mol. Mass.331.433
SMILESCN(C)c1ccc(\C=N/CCc2ccc(cc2)S(N)(=O)=O)cc1