Reaction Details
TargetCarbonic anhydrase 9
LigandBDBM50082765
Substrate/Competitorn/a
Meas. Tech.ChEMBL_1475739 (CHEMBL3424941)
Ki 10±n/a nM
Citation Durgun, MTurkmen, HCeruso, MSupuran, CT Synthesis of Schiff base derivatives of 4-(2-aminoethyl)-benzenesulfonamide with inhibitory activity against carbonic anhydrase isoforms I, II, IX and XII. Bioorg Med Chem Lett25:2377-81 (2015) 
 
Carbonic anhydrase 9
Name:Carbonic anhydrase 9
Type:Enzyme
Mol. Mass.:49669.03
Organism:Homo sapiens (Human)
Description:Catalytic domain of human cloned isozyme was used in the assay
Residue:459
BDBM50082765
NameBDBM50082765
Synonyms:CHEMBL3423264
TypeSmall organic molecule
Emp. Form.C16H20N2O2S
Mol. Mass.304.407
SMILESCc1ccc(CNCCc2ccc(cc2)S(N)(=O)=O)cc1