Reaction Details
TargetCarbonic anhydrase 2
LigandBDBM50082767
Substrate/Competitorn/a
Meas. Tech.ChEMBL_1475738 (CHEMBL3424940)
Ki 4.2±n/a nM
Citation Durgun, MTurkmen, HCeruso, MSupuran, CT Synthesis of Schiff base derivatives of 4-(2-aminoethyl)-benzenesulfonamide with inhibitory activity against carbonic anhydrase isoforms I, II, IX and XII. Bioorg Med Chem Lett25:2377-81 (2015) 
 
Carbonic anhydrase 2
Name:Carbonic anhydrase 2
Type:Enzyme
Mol. Mass.:29250.71
Organism:Homo sapiens (Human)
Description:P00918
Residue:260
BDBM50082767
NameBDBM50082767
Synonyms:CHEMBL3423266
TypeSmall organic molecule
Emp. Form.C22H24N2O3S
Mol. Mass.396.503
SMILESNS(=O)(=O)c1ccc(CCNCc2ccc(OCc3ccccc3)cc2)cc1