Reaction Details
TargetCannabinoid receptor 1
LigandBDBM50082775
Substrate/Competitorn/a
Meas. Tech.ChEMBL_1475932 (CHEMBL3425329)
Ki 2609±n/a nM
Citation Manera, CMalfitano, AMParkkari, TLucchesi, VCarpi, SFogli, SBertini, SLaezza, CLigresti, ASaccomanni, GSavinainen, JRCiaglia, EPisanti, SGazzerro, PDi Marzo, VNieri, PMacchia, MBifulco, M New quinolone- and 1,8-naphthyridine-3-carboxamides as selective CB2 receptor agonists with anticancer and immuno-modulatory activity. Eur J Med Chem97:10-8 (2015) 
 
Cannabinoid receptor 1
Name:Cannabinoid receptor 1
Type:G Protein-Coupled Receptor (GPCR)
Mol. Mass.:52868.96
Organism:Homo sapiens (Human)
Description:P21554
Residue:472
BDBM50082775
NameBDBM50082775
Synonyms:CHEMBL3422786
TypeSmall organic molecule
Emp. Form.C20H26N2O2
Mol. Mass.326.4326
SMILESCCCn1c2ccccc2cc(C(=O)NC2CCC(C)CC2)c1=O