Reaction Details
TargetFarnesyl pyrophosphate synthase
LigandBDBM50226002
Substrate/Competitorn/a
Meas. Tech.ChEMBL_1474098 (CHEMBL3424031)
IC50 200000±n/a nM
Citation Zhou, XBorn, EJAllen, CHolstein, SAWiemer, DF N-Oxide derivatives of 3-(3-pyridyl)-2-phosphonopropanoic acids as potential inhibitors of Rab geranylgeranylation. Bioorg Med Chem Lett25:2331-4 (2015) 
 
Farnesyl pyrophosphate synthase
Name:Farnesyl pyrophosphate synthase
Type:Enzyme
Mol. Mass.:48272.89
Organism:Homo sapiens (Human)
Description:P14324
Residue:419
BDBM50226002
NameBDBM50226002
Synonyms:(R)-2-hydroxy-2-phosphono-3-(pyridin-3-yl)propanoic acid 3-(3-Pyridyl)-2-hydroxy-2-phosphonopropanoic acid | CHEMBL397829
TypeSmall organic molecule
Emp. Form.C8H10NO6P
Mol. Mass.247.1419
SMILESOC(=O)C(O)(Cc1cccnc1)P(O)(O)=O