Reaction Details
TargetFarnesyl pyrophosphate synthase
LigandBDBM50083066
Substrate/Competitorn/a
Meas. Tech.ChEMBL_1474098 (CHEMBL3424031)
IC50 1000000±n/a nM
Citation Zhou, XBorn, EJAllen, CHolstein, SAWiemer, DF N-Oxide derivatives of 3-(3-pyridyl)-2-phosphonopropanoic acids as potential inhibitors of Rab geranylgeranylation. Bioorg Med Chem Lett25:2331-4 (2015) 
 
Farnesyl pyrophosphate synthase
Name:Farnesyl pyrophosphate synthase
Type:Enzyme
Mol. Mass.:48272.89
Organism:Homo sapiens (Human)
Description:P14324
Residue:419
BDBM50083066
NameBDBM50083066
Synonyms:CHEMBL240776
TypeSmall organic molecule
Emp. Form.C8H10NO5P
Mol. Mass.231.1425
SMILESOC(=O)C(Cc1cccnc1)P(O)(O)=O