Reaction Details
TargetFatty-acid amide hydrolase 1
LigandBDBM26739
Substrate/Competitorn/a
Meas. Tech.ChEMBL_1474896 (CHEMBL3423532)
IC50 58±n/a nM
Citation Aghazadeh Tabrizi, MBaraldi, PGRuggiero, ESaponaro, GBaraldi, SRomagnoli, RMartinelli, ATuccinardi, T Pyrazole phenylcyclohexylcarbamates as inhibitors of human fatty acid amide hydrolases (FAAH). Eur J Med Chem97:289-305 (2015) 
 
Fatty-acid amide hydrolase 1
Name:Fatty-acid amide hydrolase 1
Type:Protein
Mol. Mass.:63071.19
Organism:Homo sapiens (Human)
Description:O00519
Residue:579
BDBM26739
NameBDBM26739
Synonyms:3-(3-carbamoylphenyl)phenyl N-cyclohexylcarbamate URB 597 URB597 | US9187413, 1a (URB597)
TypeSmall organic molecule
Emp. Form.C20H22N2O3
Mol. Mass.338.4003
SMILESNC(=O)c1cccc(c1)-c1cccc(OC(=O)NC2CCCCC2)c1