Reaction Details
TargetCoagulation factor XIII A chain
LigandBDBM50083759
Substrate/Competitorn/a
Meas. Tech.ChEMBL_1475035 (CHEMBL3424606)
IC50 220±n/a nM
Citation Avery, CAPease, RJSmith, KBoothby, MBuckley, HMGrant, PJFishwick, CW (±) cis-Bisamido epoxides: A novel series of potent FXIII-A inhibitors. Eur J Med Chem98:49-53 (2015) 
 
Coagulation factor XIII A chain
Name:Coagulation factor XIII A chain
Type:PROTEIN
Mol. Mass.:83261.29
Organism:Homo sapiens (Human)
Description:ChEMBL_1475048
Residue:732
BDBM50083759
NameBDBM50083759
Synonyms:CHEMBL3423192
TypeSmall organic molecule
Emp. Form.C14H18N2O3
Mol. Mass.262.3043
SMILESCCCCc1ccc(NC(=O)[C@@H]2O[C@@H]2C(N)=O)cc1