Reaction Details
TargetProtein-glutamine gamma-glutamyltransferase 2
LigandBDBM50083726
Substrate/Competitorn/a
Meas. Tech.ChEMBL_1475047 (CHEMBL3424618)
IC50 48±n/a nM
Citation Avery, CAPease, RJSmith, KBoothby, MBuckley, HMGrant, PJFishwick, CW (±) cis-Bisamido epoxides: A novel series of potent FXIII-A inhibitors. Eur J Med Chem98:49-53 (2015) 
 
Protein-glutamine gamma-glutamyltransferase 2
Name:Protein-glutamine gamma-glutamyltransferase 2
Type:Protein
Mol. Mass.:77309.30
Organism:Homo sapiens (Human)
Description:P21980
Residue:687
BDBM50083726
NameBDBM50083726
Synonyms:CHEMBL3423194
TypeSmall organic molecule
Emp. Form.C10H9ClN2O3
Mol. Mass.240.643
SMILESNC(=O)[C@H]1O[C@H]1C(=O)Nc1cccc(Cl)c1