Reaction Details
TargetPeroxisome proliferator-activated receptor gamma
LigandBDBM50030474
Substrate/Competitorn/a
Meas. Tech.ChEMBL_1477131 (CHEMBL3428440)
Ki 27±n/a nM
Citation Du, GFeng, LYang, ZShi, JHuang, CGuo, FLi, BZhu, WLi, Y Separation and peroxisome proliferator-activated receptor-¿ agonist activity evaluation of synthetic racemic bavachinin enantiomers. Bioorg Med Chem Lett25:2579-83 (2015) 
 
Peroxisome proliferator-activated receptor gamma
Name:Peroxisome proliferator-activated receptor gamma
Type:Nuclear Receptor
Mol. Mass.:57613.46
Organism:Homo sapiens (Human)
Description:P37231
Residue:505
BDBM50030474
NameBDBM50030474
Synonyms:Avandamet Avandia CHEBI:50122 US10744117, Compound Rosiglitazone | US9562012, rosiglitazone
TypeSmall organic molecule
Emp. Form.C18H19N3O3S
Mol. Mass.357.427
SMILESCN(CCOc1ccc(CC2SC(=O)NC2=O)cc1)c1ccccn1