Reaction Details
TargetHematopoietic prostaglandin D synthase
LigandBDBM50084150
Substrate/Competitorn/a
Meas. Tech.ChEMBL_1477160 (CHEMBL3428600)
Kd 340±n/a nM
Citation Edfeldt, FEvenäs, JLepistö, MWard, APetersen, JWissler, LRohman, MSivars, USvensson, KPerry, MFeierberg, IZhou, XHHansson, TNarjes, F Identification of indole inhibitors of human hematopoietic prostaglandin D2 synthase (hH-PGDS). Bioorg Med Chem Lett25:2496-500 (2015) 
 
Hematopoietic prostaglandin D synthase
Name:Hematopoietic prostaglandin D synthase
Type:Enzyme
Mol. Mass.:23341.07
Organism:Homo sapiens (Human)
Description:The protein was expressed in E. coli strain BL21(DE3) with an N-terminal 6-His tag.
Residue:199
BDBM50084150
NameBDBM50084150
Synonyms:CHEMBL3425951
TypeSmall organic molecule
Emp. Form.C18H20N4O
Mol. Mass.308.3776
SMILESCN(C)CCC(=O)Nc1cncc(c1)-c1cccc2[nH]ccc12