Reaction Details
TargetHematopoietic prostaglandin D synthase
LigandBDBM50084149
Substrate/Competitorn/a
Meas. Tech.ChEMBL_1477159 (CHEMBL3428468)
IC50 2900±n/a nM
Citation Edfeldt, FEvenäs, JLepistö, MWard, APetersen, JWissler, LRohman, MSivars, USvensson, KPerry, MFeierberg, IZhou, XHHansson, TNarjes, F Identification of indole inhibitors of human hematopoietic prostaglandin D2 synthase (hH-PGDS). Bioorg Med Chem Lett25:2496-500 (2015) 
 
Hematopoietic prostaglandin D synthase
Name:Hematopoietic prostaglandin D synthase
Type:Enzyme
Mol. Mass.:23341.07
Organism:Homo sapiens (Human)
Description:The protein was expressed in E. coli strain BL21(DE3) with an N-terminal 6-His tag.
Residue:199
BDBM50084149
NameBDBM50084149
Synonyms:CHEMBL3425952
TypeSmall organic molecule
Emp. Form.C15H16N4O3
Mol. Mass.300.3125
SMILESCOCCCNC(=O)c1nc(no1)-c1cccc2[nH]ccc12