Reaction Details
TargetHematopoietic prostaglandin D synthase
LigandBDBM50084263
Substrate/Competitorn/a
Meas. Tech.ChEMBL_1477160 (CHEMBL3428600)
Kd 13000±n/a nM
Citation Edfeldt, FEvenäs, JLepistö, MWard, APetersen, JWissler, LRohman, MSivars, USvensson, KPerry, MFeierberg, IZhou, XHHansson, TNarjes, F Identification of indole inhibitors of human hematopoietic prostaglandin D2 synthase (hH-PGDS). Bioorg Med Chem Lett25:2496-500 (2015) 
 
Hematopoietic prostaglandin D synthase
Name:Hematopoietic prostaglandin D synthase
Type:Enzyme
Mol. Mass.:23341.07
Organism:Homo sapiens (Human)
Description:The protein was expressed in E. coli strain BL21(DE3) with an N-terminal 6-His tag.
Residue:199
BDBM50084263
NameBDBM50084263
Synonyms:CHEMBL3425964
TypeSmall organic molecule
Emp. Form.C17H24F3N5O
Mol. Mass.371.4006
SMILESFC(F)(F)CN1CCC(CC1)NC(=O)c1ccc(nc1)N1CCNCC1