Reaction Details
TargetHematopoietic prostaglandin D synthase
LigandBDBM21615
Substrate/Competitorn/a
Meas. Tech.ChEMBL_1477161 (CHEMBL3428601)
Kd 140000±n/a nM
Citation Edfeldt, FEvenäs, JLepistö, MWard, APetersen, JWissler, LRohman, MSivars, USvensson, KPerry, MFeierberg, IZhou, XHHansson, TNarjes, F Identification of indole inhibitors of human hematopoietic prostaglandin D2 synthase (hH-PGDS). Bioorg Med Chem Lett25:2496-500 (2015) 
 
Hematopoietic prostaglandin D synthase
Name:Hematopoietic prostaglandin D synthase
Type:Enzyme
Mol. Mass.:23341.07
Organism:Homo sapiens (Human)
Description:The protein was expressed in E. coli strain BL21(DE3) with an N-terminal 6-His tag.
Residue:199
BDBM21615
NameBDBM21615
Synonyms:1-phenyl-1H-pyrazole-4-carboxylic acid | Pyrazole, 1
TypeSmall organic molecule
Emp. Form.C10H8N2O2
Mol. Mass.188.1827
SMILESOC(=O)c1cnn(c1)-c1ccccc1