Reaction Details
TargetProto-oncogene tyrosine-protein kinase receptor Ret
LigandBDBM50021574
Substrate/Competitorn/a
Meas. Tech.ChEMBL_1477230 (CHEMBL3428795)
IC50 5.0±n/a nM
Citation Song, M Progress in Discovery of KIF5B-RET Kinase Inhibitors for the Treatment of Non-Small-Cell Lung Cancer. J Med Chem58:3672-81 (2015) 
 
Proto-oncogene tyrosine-protein kinase receptor Ret
Name:Proto-oncogene tyrosine-protein kinase receptor Ret
Type:Protein
Mol. Mass.:124318.29
Organism:Homo sapiens (Human)
Description:P07949
Residue:1114
BDBM50021574
NameBDBM50021574
Synonyms:BMS-907351 CHEBI:72317 Cometriq US10202365, Compound Cabozantinib US10273211, Compound Cabozantinib US10774070, Compound Cabozantinib XL-184 | cabozantinib s-malate
TypeSmall organic molecule
Emp. Form.C28H24FN3O5
Mol. Mass.501.5057
SMILESCOc1cc2nccc(Oc3ccc(NC(=O)C4(CC4)C(=O)Nc4ccc(F)cc4)cc3)c2cc1OC