Reaction Details
TargetMuscarinic acetylcholine receptor M3
LigandBDBM50296345
Substrate/Competitorn/a
Meas. Tech.ChEMBL_1477237 (CHEMBL3428929)
Ki 0.031623±n/a nM
Citation Hughes, ADChen, YHegde, SSJasper, JRJaw-Tsai, SLee, TWMcNamara, APulido-Rios, MTSteinfeld, TMammen, M Discovery of (R)-1-(3-((2-chloro-4-(((2-hydroxy-2-(8-hydroxy-2-oxo-1,2-dihydroquinolin-5-yl)ethyl)amino)methyl)-5-methoxyphenyl)amino)-3-oxopropyl)piperidin-4-yl [1,1'-biphenyl]-2-ylcarbamate (TD-5959, GSK961081, batefenterol): first-in-class dual pharmacology multivalent muscarinic antagonist.. J Med Chem58:2609-22 (2015) 
 
Muscarinic acetylcholine receptor M3
Name:Muscarinic acetylcholine receptor M3
Type:Enzyme
Mol. Mass.:66151.03
Organism:Homo sapiens (Human)
Description:P20309
Residue:590
BDBM50296345
NameBDBM50296345
Synonyms:(1R,2R,4S,5R,7S)-7-(2-hydroxy-2,2-di-thiophen-2-yl-acetoxy)-9,9-dimethyl-3-oxa-9-azonia-tricyclo[3.3.1.0*2,4*]nonane bromide Tiotropium Bromide
TypeSmall organic molecule
Emp. Form.C19H22NO4S2
Mol. Mass.392.512
SMILESC[N+]1(C)[C@@H]2C[C@H](C[C@@H]1[C@@H]1O[C@H]21)OC(=O)C(O)(c1cccs1)c1cccs1