Reaction Details
TargetMuscarinic acetylcholine receptor M3
LigandBDBM50084436
Substrate/Competitorn/a
Meas. Tech.ChEMBL_1477237 (CHEMBL3428929)
Ki 0.050119±n/a nM
Citation Hughes, ADChen, YHegde, SSJasper, JRJaw-Tsai, SLee, TWMcNamara, APulido-Rios, MTSteinfeld, TMammen, M Discovery of (R)-1-(3-((2-chloro-4-(((2-hydroxy-2-(8-hydroxy-2-oxo-1,2-dihydroquinolin-5-yl)ethyl)amino)methyl)-5-methoxyphenyl)amino)-3-oxopropyl)piperidin-4-yl [1,1'-biphenyl]-2-ylcarbamate (TD-5959, GSK961081, batefenterol): first-in-class dual pharmacology multivalent muscarinic antagonist.. J Med Chem58:2609-22 (2015) 
 
Muscarinic acetylcholine receptor M3
Name:Muscarinic acetylcholine receptor M3
Type:Enzyme
Mol. Mass.:66151.03
Organism:Homo sapiens (Human)
Description:P20309
Residue:590
BDBM50084436
NameBDBM50084436
Synonyms:CHEMBL3426693
TypeSmall organic molecule
Emp. Form.C40H43N5O6
Mol. Mass.689.7993
SMILESCc1cc(CNC[C@H](O)c2ccc(O)c3[nH]c(=O)ccc23)ccc1NC(=O)CCN1CCC(CC1)OC(=O)Nc1ccccc1-c1ccccc1