Reaction Details
TargetMuscarinic acetylcholine receptor M3
LigandBDBM50084443
Substrate/Competitorn/a
Meas. Tech.ChEMBL_1477237 (CHEMBL3428929)
Ki 0.079433±n/a nM
Citation Hughes, ADChen, YHegde, SSJasper, JRJaw-Tsai, SLee, TWMcNamara, APulido-Rios, MTSteinfeld, TMammen, M Discovery of (R)-1-(3-((2-chloro-4-(((2-hydroxy-2-(8-hydroxy-2-oxo-1,2-dihydroquinolin-5-yl)ethyl)amino)methyl)-5-methoxyphenyl)amino)-3-oxopropyl)piperidin-4-yl [1,1'-biphenyl]-2-ylcarbamate (TD-5959, GSK961081, batefenterol): first-in-class dual pharmacology multivalent muscarinic antagonist.. J Med Chem58:2609-22 (2015) 
 
Muscarinic acetylcholine receptor M3
Name:Muscarinic acetylcholine receptor M3
Type:Enzyme
Mol. Mass.:66151.03
Organism:Homo sapiens (Human)
Description:P20309
Residue:590
BDBM50084443
NameBDBM50084443
Synonyms:CHEMBL3426687
TypeSmall organic molecule
Emp. Form.C39H41N5O6
Mol. Mass.675.7727
SMILESO[C@@H](CNCc1ccc(NC(=O)CCN2CCC(CC2)OC(=O)Nc2ccccc2-c2ccccc2)cc1)c1ccc(O)c2[nH]c(=O)ccc12