Reaction Details
TargetActivated CDC42 kinase 1
LigandBDBM50084451
Substrate/Competitorn/a
Meas. Tech.ChEMBL_1477698 (CHEMBL3428296)
IC50 48±n/a nM
Citation Lawrence, HRMahajan, KLuo, YZhang, DTindall, NHuseyin, MGevariya, HKazi, SOzcan, SMahajan, NPLawrence, NJ Development of novel ACK1/TNK2 inhibitors using a fragment-based approach. J Med Chem58:2746-63 (2015) 
 
Activated CDC42 kinase 1
Name:Activated CDC42 kinase 1
Type:Protein
Mol. Mass.:114577.86
Organism:Homo sapiens (Human)
Description:Q07912
Residue:1038
BDBM50084451
NameBDBM50084451
Synonyms:CHEMBL3426867
TypeSmall organic molecule
Emp. Form.C26H28ClFN6O3
Mol. Mass.526.99
SMILESFc1cccc(Cl)c1NC(=O)c1cnc(Nc2ccc(cc2)N2CCOCC2)nc1NCC1CCCO1