Reaction Details
TargetProto-oncogene tyrosine-protein kinase ROS
LigandBDBM50084464
Substrate/Competitorn/a
Meas. Tech.ChEMBL_1477872 (CHEMBL3429151)
IC50 124±n/a nM
Citation Lawrence, HRMahajan, KLuo, YZhang, DTindall, NHuseyin, MGevariya, HKazi, SOzcan, SMahajan, NPLawrence, NJ Development of novel ACK1/TNK2 inhibitors using a fragment-based approach. J Med Chem58:2746-63 (2015) 
 
Proto-oncogene tyrosine-protein kinase ROS
Name:Proto-oncogene tyrosine-protein kinase ROS
Type:Enzyme
Mol. Mass.:263897.39
Organism:Homo sapiens (Human)
Description:P08922
Residue:2347
BDBM50084464
NameBDBM50084464
Synonyms:CHEMBL3426891
TypeSmall organic molecule
Emp. Form.C20H27ClN6O
Mol. Mass.402.921
SMILESCN1CCN(CC1)c1ccc(Nc2ncc(Cl)c(NC[C@H]3CCCO3)n2)cc1