Reaction Details
TargetPatatin-like phospholipase domain-containing protein 2
LigandBDBM50084901
Substrate/Competitorn/a
Meas. Tech.ChEMBL_1476694 (CHEMBL3428915)
IC50 140000±n/a nM
Citation Mayer, NSchweiger, MMelcher, MCFledelius, CZechner, RZimmermann, RBreinbauer, R Structure-activity studies in the development of a hydrazone based inhibitor of adipose-triglyceride lipase (ATGL). Bioorg Med Chem23:2904-16 (2015) 
 
Patatin-like phospholipase domain-containing protein 2
Name:Patatin-like phospholipase domain-containing protein 2
Type:PROTEIN
Mol. Mass.:53655.79
Organism:Mus musculus
Description:ChEMBL_109612
Residue:486
BDBM50084901
NameBDBM50084901
Synonyms:CHEMBL3427349
TypeSmall organic molecule
Emp. Form.C16H18N4
Mol. Mass.266.3409
SMILESC1CN(CCN1\N=C\c1ccncc1)c1ccccc1