Reaction Details
TargetChronophin
LigandBDBM50084933
Substrate/Competitorn/a
Meas. Tech.ChEMBL_1476762 (CHEMBL3429276)
IC50 1300000±n/a nM
Citation Knobloch, GJabari, NStadlbauer, SSchindelin, HKöhn, MGohla, A Synthesis of hydrolysis-resistant pyridoxal 5'-phosphate analogs and their biochemical and X-ray crystallographic characterization with the pyridoxal phosphatase chronophin. Bioorg Med Chem23:2819-27 (2015) 
 
Chronophin
Name:Chronophin
Type:PROTEIN
Mol. Mass.:31508.48
Organism:Mus musculus
Description:ChEMBL_109613
Residue:292
BDBM50084933
NameBDBM50084933
Synonyms:CHEMBL3427371
TypeSmall organic molecule
Emp. Form.C9H12NO5P
Mol. Mass.245.169
SMILESCc1ncc(\C=C\P(O)(O)=O)c(CO)c1O