Reaction Details
TargetChronophin
LigandBDBM50084936
Substrate/Competitorn/a
Meas. Tech.ChEMBL_1476762 (CHEMBL3429276)
IC50 79000±n/a nM
Citation Knobloch, GJabari, NStadlbauer, SSchindelin, HKöhn, MGohla, A Synthesis of hydrolysis-resistant pyridoxal 5'-phosphate analogs and their biochemical and X-ray crystallographic characterization with the pyridoxal phosphatase chronophin. Bioorg Med Chem23:2819-27 (2015) 
 
Chronophin
Name:Chronophin
Type:PROTEIN
Mol. Mass.:31508.48
Organism:Mus musculus
Description:ChEMBL_109613
Residue:292
BDBM50084936
NameBDBM50084936
Synonyms:CHEMBL3427368
TypeSmall organic molecule
Emp. Form.C9H12NO5P
Mol. Mass.245.169
SMILESCc1ncc(CCP(O)(O)=O)c(C=O)c1O