Reaction Details
TargetEstrogen receptor
LigandBDBM50084971
Substrate/Competitorn/a
Meas. Tech.ChEMBL_1476876 (CHEMBL3429910)
IC50 1.000000±n/a nM
Citation Degorce, SLBailey, ACallis, RDe Savi, CDucray, RLamont, GMacFaul, PMaudet, MMartin, SMorgentin, RNorman, RAPeru, APink, JHPlé, PARoberts, BScott, JS Investigation of (E)-3-[4-(2-Oxo-3-aryl-chromen-4-yl)oxyphenyl]acrylic Acids as Oral Selective Estrogen Receptor Down-Regulators. J Med Chem58:3522-33 (2015) 
 
Estrogen receptor
Name:Estrogen receptor
Type:Protein
Mol. Mass.:66230.44
Organism:Homo sapiens (Human)
Description:P03372
Residue:595
BDBM50084971
NameBDBM50084971
Synonyms:CHEMBL3427399
TypeSmall organic molecule
Emp. Form.C27H19F3O6
Mol. Mass.496.4314
SMILESCc1cc(OC(F)(F)F)ccc1-c1c(Cc2ccc(\C=C\C(O)=O)cc2)c2ccc(O)cc2oc1=O