Reaction Details
TargetCarbonic anhydrase 2
LigandBDBM50085926
Substrate/Competitorn/a
Meas. Tech.ChEMBL_1477764 (CHEMBL3428640)
Ki 31.1±n/a nM
Citation Tanc, MCarta, FScozzafava, ASupuran, CT a-Carbonic Anhydrases Possess Thioesterase Activity. ACS Med Chem Lett6:292-5 (2015) 
 
Carbonic anhydrase 2
Name:Carbonic anhydrase 2
Type:Enzyme
Mol. Mass.:29250.71
Organism:Homo sapiens (Human)
Description:P00918
Residue:260
BDBM50085926
NameBDBM50085926
Synonyms:CHEMBL3425587
TypeSmall organic molecule
Emp. Form.C8H9NO2S3
Mol. Mass.247.358
SMILESCSC(=S)NS(=O)(=O)c1ccccc1