Reaction Details
TargetCatechol O-methyltransferase
LigandBDBM50086217
Substrate/Competitorn/a
Meas. Tech.ChEMBL_1477936 (CHEMBL3429503)
IC50 180±n/a nM
Citation Harrison, STPoslusney, MSMulhearn, JJZhao, ZKett, NRSchubert, JWMelamed, JYAllison, TJPatel, SBSanders, JMSharma, SSmith, RFHall, DLRobinson, RGSachs, NAHutson, PHWolkenberg, SEBarrow, JC Synthesis and Evaluation of Heterocyclic Catechol Mimics as Inhibitors of Catechol-O-methyltransferase (COMT). ACS Med Chem Lett6:318-23 (2015) 
 
Catechol O-methyltransferase
Name:Catechol O-methyltransferase
Type:Enzyme
Mol. Mass.:30030.67
Organism:Homo sapiens (Human)
Description:P21964
Residue:271
BDBM50086217
NameBDBM50086217
Synonyms:CHEMBL3425741
TypeSmall organic molecule
Emp. Form.C21H21NO3
Mol. Mass.335.3963
SMILESCC(C)C(O)c1cc(=O)c(O)cn1-c1cccc(c1)-c1ccccc1