Reaction Details
TargetCatechol O-methyltransferase
LigandBDBM50086213
Substrate/Competitorn/a
Meas. Tech.ChEMBL_1477938 (CHEMBL3429505)
IC50 1100±n/a nM
Citation Harrison, STPoslusney, MSMulhearn, JJZhao, ZKett, NRSchubert, JWMelamed, JYAllison, TJPatel, SBSanders, JMSharma, SSmith, RFHall, DLRobinson, RGSachs, NAHutson, PHWolkenberg, SEBarrow, JC Synthesis and Evaluation of Heterocyclic Catechol Mimics as Inhibitors of Catechol-O-methyltransferase (COMT). ACS Med Chem Lett6:318-23 (2015) 
 
Catechol O-methyltransferase
Name:Catechol O-methyltransferase
Type:Enzyme
Mol. Mass.:30030.67
Organism:Homo sapiens (Human)
Description:P21964
Residue:271
BDBM50086213
NameBDBM50086213
Synonyms:CHEMBL3425734
TypeSmall organic molecule
Emp. Form.C17H13NO2
Mol. Mass.263.2906
SMILESOc1cn(ccc1=O)-c1cccc(c1)-c1ccccc1