Reaction Details
TargetFarnesyl pyrophosphate synthase
LigandBDBM12578
Substrate/Competitorn/a
Meas. Tech.ChEMBL_1478080 (CHEMBL3430142)
IC50 200±n/a nM
Citation Liu, YLCao, RWang, YOldfield, E Farnesyl diphosphate synthase inhibitors with unique ligand-binding geometries. ACS Med Chem Lett6:349-54 (2015) 
 
Farnesyl pyrophosphate synthase
Name:Farnesyl pyrophosphate synthase
Type:Enzyme
Mol. Mass.:48272.89
Organism:Homo sapiens (Human)
Description:P14324
Residue:419
BDBM12578
NameBDBM12578
Synonyms:2-(imidazol-1-yl)-1-hydroxyethylidene-1,1-bisphosphonic acid CGP-42446 JMC515594 Compound 55 US11279719, Example Zolendronic acid (ZOL) Zoledronate [1-hydroxy-2-(1H-imidazol-1-yl)-1-phosphonoethyl]phosphonic acid | zoledronic acid
TypeSmall organic molecule
Emp. Form.C5H10N2O7P2
Mol. Mass.272.0896
SMILESOC(Cn1ccnc1)(P(O)(O)=O)P(O)(O)=O