Reaction Details
TargetFarnesyl pyrophosphate synthase
LigandBDBM97430
Substrate/Competitorn/a
Meas. Tech.ChEMBL_1478080 (CHEMBL3430142)
IC50 1800±n/a nM
Citation Liu, YLCao, RWang, YOldfield, E Farnesyl diphosphate synthase inhibitors with unique ligand-binding geometries. ACS Med Chem Lett6:349-54 (2015) 
 
Farnesyl pyrophosphate synthase
Name:Farnesyl pyrophosphate synthase
Type:Enzyme
Mol. Mass.:48272.89
Organism:Homo sapiens (Human)
Description:P14324
Residue:419
BDBM97430
NameBDBM97430
Synonyms:50460, 14 | BPH-1358
TypeSmall molecule
Emp. Form.C32H28N6O2
Mol. Mass.528.6037
SMILESO=C(Nc1cccc(c1)C1=NCCN1)c1ccc(cc1)-c1ccc(cc1)C(=O)Nc1cccc(c1)C1=NCCN1