Reaction Details
TargetCyclin-G-associated kinase
LigandBDBM50086272
Substrate/Competitorn/a
Meas. Tech.ChEMBL_1478106 (CHEMBL3430283)
Kd 320±n/a nM
Citation Kovackova, SChang, LBekerman, ENeveu, GBarouch-Bentov, RChaikuad, AHeroven, C?ála, MDe Jonghe, SKnapp, SEinav, SHerdewijn, P Selective Inhibitors of Cyclin G Associated Kinase (GAK) as Anti-Hepatitis C Agents. J Med Chem58:3393-410 (2015) 
 
Cyclin-G-associated kinase
Name:Cyclin-G-associated kinase
Type:PROTEIN
Mol. Mass.:143171.28
Organism:Homo sapiens (Human)
Description:ChEMBL_1478229
Residue:1311
BDBM50086272
NameBDBM50086272
Synonyms:CHEMBL3425871
TypeSmall organic molecule
Emp. Form.C18H21N3O4S
Mol. Mass.375.442
SMILESCOc1ccc(cc1OC)-c1cnc2c(snc2c1)N(CCO)CCO