Reaction Details
TargetADP-ribosyl cyclase/cyclic ADP-ribose hydrolase 1
LigandBDBM50086336
Substrate/Competitorn/a
Meas. Tech.ChEMBL_1476003 (CHEMBL3428359)
IC50 1.4±n/a nM
Citation Haffner, CDBecherer, JDBoros, EECadilla, RCarpenter, TCowan, DDeaton, DNGuo, YHarrington, WHenke, BRJeune, MRKaldor, IMilliken, NPetrov, KGPreugschat, FSchulte, CShearer, BGShearer, TSmalley, TLStewart, ELStuart, JDUlrich, JC Discovery, Synthesis, and Biological Evaluation of Thiazoloquin(az)olin(on)es as Potent CD38 Inhibitors. J Med Chem58:3548-71 (2015) 
 
ADP-ribosyl cyclase/cyclic ADP-ribose hydrolase 1
Name:ADP-ribosyl cyclase/cyclic ADP-ribose hydrolase 1
Type:PROTEIN
Mol. Mass.:34333.62
Organism:Homo sapiens (Human)
Description:ChEMBL_1509931
Residue:300
BDBM50086336
NameBDBM50086336
Synonyms:CHEMBL3426065
TypeSmall organic molecule
Emp. Form.C21H24N4O2S
Mol. Mass.396.506
SMILESCNC(=O)[C@H]1CC[C@@H](CC1)Nc1cc(=O)[nH]c2c(C)cc(cc12)-c1cncs1