Reaction Details
TargetADP-ribosyl cyclase/cyclic ADP-ribose hydrolase 1
LigandBDBM50086315
Substrate/Competitorn/a
Meas. Tech.ChEMBL_1476003 (CHEMBL3428359)
IC50 498±n/a nM
Citation Haffner, CDBecherer, JDBoros, EECadilla, RCarpenter, TCowan, DDeaton, DNGuo, YHarrington, WHenke, BRJeune, MRKaldor, IMilliken, NPetrov, KGPreugschat, FSchulte, CShearer, BGShearer, TSmalley, TLStewart, ELStuart, JDUlrich, JC Discovery, Synthesis, and Biological Evaluation of Thiazoloquin(az)olin(on)es as Potent CD38 Inhibitors. J Med Chem58:3548-71 (2015) 
 
ADP-ribosyl cyclase/cyclic ADP-ribose hydrolase 1
Name:ADP-ribosyl cyclase/cyclic ADP-ribose hydrolase 1
Type:PROTEIN
Mol. Mass.:34333.62
Organism:Homo sapiens (Human)
Description:ChEMBL_1509931
Residue:300
BDBM50086315
NameBDBM50086315
Synonyms:CHEMBL3426043
TypeSmall organic molecule
Emp. Form.C18H18N4O2S
Mol. Mass.354.426
SMILESOC(=O)[C@H]1CC[C@@H](CC1)Nc1ncnc2ccc(cc12)-c1cncs1