Reaction Details
TargetADP-ribosyl cyclase/cyclic ADP-ribose hydrolase 1
LigandBDBM50086350
Substrate/Competitorn/a
Meas. Tech.ChEMBL_1476004 (CHEMBL3428360)
IC50 1.000000±n/a nM
Citation Haffner, CDBecherer, JDBoros, EECadilla, RCarpenter, TCowan, DDeaton, DNGuo, YHarrington, WHenke, BRJeune, MRKaldor, IMilliken, NPetrov, KGPreugschat, FSchulte, CShearer, BGShearer, TSmalley, TLStewart, ELStuart, JDUlrich, JC Discovery, Synthesis, and Biological Evaluation of Thiazoloquin(az)olin(on)es as Potent CD38 Inhibitors. J Med Chem58:3548-71 (2015) 
 
ADP-ribosyl cyclase/cyclic ADP-ribose hydrolase 1
Name:ADP-ribosyl cyclase/cyclic ADP-ribose hydrolase 1
Type:PROTEIN
Mol. Mass.:34417.04
Organism:Mus musculus
Description:ChEMBL_109609
Residue:304
BDBM50086350
NameBDBM50086350
Synonyms:CHEMBL3426058
TypeSmall organic molecule
Emp. Form.C19H22N4O2S
Mol. Mass.370.469
SMILESCO[C@H]1CC[C@@H](CC1)Nc1nc(O)nc2c(C)cc(cc12)-c1cncs1