Reaction Details
TargetADP-ribosyl cyclase/cyclic ADP-ribose hydrolase 1
LigandBDBM50086437
Substrate/Competitorn/a
Meas. Tech.ChEMBL_1476004 (CHEMBL3428360)
IC50 1.6±n/a nM
Citation Haffner, CDBecherer, JDBoros, EECadilla, RCarpenter, TCowan, DDeaton, DNGuo, YHarrington, WHenke, BRJeune, MRKaldor, IMilliken, NPetrov, KGPreugschat, FSchulte, CShearer, BGShearer, TSmalley, TLStewart, ELStuart, JDUlrich, JC Discovery, Synthesis, and Biological Evaluation of Thiazoloquin(az)olin(on)es as Potent CD38 Inhibitors. J Med Chem58:3548-71 (2015) 
 
ADP-ribosyl cyclase/cyclic ADP-ribose hydrolase 1
Name:ADP-ribosyl cyclase/cyclic ADP-ribose hydrolase 1
Type:PROTEIN
Mol. Mass.:34417.04
Organism:Mus musculus
Description:ChEMBL_109609
Residue:304
BDBM50086437
NameBDBM50086437
Synonyms:CHEMBL3426038
TypeSmall organic molecule
Emp. Form.C20H23N3O2S
Mol. Mass.369.481
SMILESCO[C@H]1CC[C@@H](CC1)Nc1cc(=O)n(C)c2ccc(cc12)-c1cncs1