Reaction Details
TargetAurora kinase A
LigandBDBM50086441
Substrate/Competitorn/a
Meas. Tech.ChEMBL_1476365 (CHEMBL3429888)
IC50>10000±n/a nM
Citation Zhang, CHZheng, MWLi, YPLin, XDHuang, MZhong, LLi, GBZhang, RJLin, WTJiao, YWu, XAYang, JXiang, RChen, LJZhao, YLCheng, WWei, YQYang, SY Design, Synthesis, and Structure-Activity Relationship Studies of 3-(Phenylethynyl)-1H-pyrazolo[3,4-d]pyrimidin-4-amine Derivatives as a New Class of Src Inhibitors with Potent Activities in Models of Triple Negative Breast Cancer. J Med Chem58:3957-74 (2015) 
 
Aurora kinase A
Name:Aurora kinase A
Type:Serine/threonine-protein kinase
Mol. Mass.:45830.98
Organism:Homo sapiens (Human)
Description:O14965
Residue:403
BDBM50086441
NameBDBM50086441
Synonyms:CHEMBL3426225 | US10266537, Compound 3
TypeSmall organic molecule
Emp. Form.C30H31F3N8O
Mol. Mass.576.6153
SMILESCCn1nc(C#Cc2cc(ccc2C)C(=O)Nc2ccc(CN3CCN(C)CC3)c(c2)C(F)(F)F)c2c(N)ncnc12