Reaction Details
TargetProto-oncogene tyrosine-protein kinase Src
LigandBDBM50322535
Substrate/Competitorn/a
Meas. Tech.ChEMBL_1476339 (CHEMBL3429862)
IC50 3.0±n/a nM
Citation Zhang, CHZheng, MWLi, YPLin, XDHuang, MZhong, LLi, GBZhang, RJLin, WTJiao, YWu, XAYang, JXiang, RChen, LJZhao, YLCheng, WWei, YQYang, SY Design, Synthesis, and Structure-Activity Relationship Studies of 3-(Phenylethynyl)-1H-pyrazolo[3,4-d]pyrimidin-4-amine Derivatives as a New Class of Src Inhibitors with Potent Activities in Models of Triple Negative Breast Cancer. J Med Chem58:3957-74 (2015) 
 
Proto-oncogene tyrosine-protein kinase Src
Name:Proto-oncogene tyrosine-protein kinase Src
Type:Protein
Mol. Mass.:59838.60
Organism:Homo sapiens (Human)
Description:P12931
Residue:536
BDBM50322535
NameBDBM50322535
Synonyms:3-(imidazo[1,2-b]pyridazin-3-ylethynyl)-4-methyl-N-{4-[(4-methylpiperazin-1-yl)methyl]-3-(trifluoromethyl)phenyl}benzamide CHEMBL1171837 US10464902, Ponatinib | US9255107, AP24534
TypeSmall organic molecule
Emp. Form.C29H27F3N6O
Mol. Mass.532.5595
SMILESCN1CCN(Cc2ccc(NC(=O)c3ccc(C)c(c3)C#Cc3cnc4cccnn34)cc2C(F)(F)F)CC1