Reaction Details
TargetProto-oncogene tyrosine-protein kinase Src
LigandBDBM50086452
Substrate/Competitorn/a
Meas. Tech.ChEMBL_1476339 (CHEMBL3429862)
IC50 21±n/a nM
Citation Zhang, CHZheng, MWLi, YPLin, XDHuang, MZhong, LLi, GBZhang, RJLin, WTJiao, YWu, XAYang, JXiang, RChen, LJZhao, YLCheng, WWei, YQYang, SY Design, Synthesis, and Structure-Activity Relationship Studies of 3-(Phenylethynyl)-1H-pyrazolo[3,4-d]pyrimidin-4-amine Derivatives as a New Class of Src Inhibitors with Potent Activities in Models of Triple Negative Breast Cancer. J Med Chem58:3957-74 (2015) 
 
Proto-oncogene tyrosine-protein kinase Src
Name:Proto-oncogene tyrosine-protein kinase Src
Type:Protein
Mol. Mass.:59838.60
Organism:Homo sapiens (Human)
Description:P12931
Residue:536
BDBM50086452
NameBDBM50086452
Synonyms:CHEMBL3426221
TypeSmall organic molecule
Emp. Form.C30H30F3N7O2
Mol. Mass.577.6001
SMILESCC(C)n1nc(C#Cc2cc(ccc2C)C(=O)Nc2ccc(CN3CCOCC3)c(c2)C(F)(F)F)c2c(N)ncnc12