Reaction Details
TargetTyrosine-protein kinase ITK/TSK
LigandBDBM50086605
Substrate/Competitorn/a
Meas. Tech.ChEMBL_1477113 (CHEMBL3428280)
Ki 0.300000±n/a nM
Citation Burch, JDBarrett, KChen, YDeVoss, JEigenbrot, CGoldsmith, RIsmaili, MHLau, KLin, ZOrtwine, DFZarrin, AAMcEwan, PABarker, JJEllebrandt, CKordt, DStein, DBWang, XChen, YHu, BXu, XYuen, PWZhang, YPei, Z Tetrahydroindazoles as Interleukin-2 Inducible T-Cell Kinase Inhibitors. Part II. Second-Generation Analogues with Enhanced Potency, Selectivity, and Pharmacodynamic Modulation in Vivo. J Med Chem58:3806-16 (2015) 
 
Tyrosine-protein kinase ITK/TSK
Name:Tyrosine-protein kinase ITK/TSK
Type:Protein
Mol. Mass.:71839.20
Organism:Homo sapiens (Human)
Description:Q08881
Residue:620
BDBM50086605
NameBDBM50086605
Synonyms:CHEMBL3426307
TypeSmall organic molecule
Emp. Form.C20H19F2N5O
Mol. Mass.383.3946
SMILESCC12Cc3[nH]nc(C(=O)Nc4cnn(Cc5ccccc5)c4)c3CC1C2(F)F